{"text_format":"1","workbook":"xlsx","n_sheets":5,"sheets":["Assumptions & Lists","Risk Free & Inflation","Data","Trader","Advanced"],"not_rendered":{"charts":3,"images":1,"macros":1,"external_links":0,"defined_names":30,"comments":0,"pivot_tables":0},"unopened":[],"bounds":{"document_bytes":16777216,"sheet_cells":100000,"rows_first":2000,"rows_last":500,"rows_between":2000,"halvings":0,"cell_chars":16384,"cell_head_chars":4096},"cells_cut":0,"cells_raw":0,"read":"whole","date_system":"1900"}

{"sheet":"Assumptions & Lists","index":0,"n_rows":30,"n_cols":11,"rows_kept":30,"cut":false,"hidden":true,"merged":[]}
[]
[null,null,"days in yr","365,25"]
[null,null,"daysinyr value",{"$f":"_xlfn.NUMBERVALUE(D2)","v":365.25}]
[null,null,"Style","American","European"]
[null,null,"inflation",0]
[]
[]
[null,null,0,"Price"]
[null,null,1,"Delta"]
[null,null,2,"Gamma"]
[null,null,3,"Vega"]
[null,null,4,"theta"]
[null,null,5,"Rho"]
[]
[null,null,"Move","Long","Short"]
[null,null,"Type","Put","Call","Stock"]
[]
[null,null,"Strategy","Call Spread","Put Spread","Butterfly","Condor","Strangle","Straddle","Call TimeSpread","Put TimeSpread"]
[]
[null,null,"Greeks",{"$f":"TRUE","v":true},{"$f":"FALSE","v":false}]
[]
[null,null,"PlotGreek",{"$f":"FALSE","v":false},"Delta","Gamma","Vega","Theta","Rho"]
[]
[null,null,"TimeSpread",{"$f":"TRUE","v":true},{"$f":"FALSE","v":false}]
[]
[null,null,"HideContractAnalysis",false]
[null,null,"HideStratAnalysis",false]
[]
[null,null,"Search","T_1","T_2","All"]
[null,null,"SearchEffective",{"$f":"IF(Trader!$K$3,'Assumptions & Lists'!$D$29:$F$29,'Assumptions & Lists'!$F$29)","v":"All"}]
{"$rows_left_out":1}
{"sheet":"Risk Free & Inflation","index":1,"n_rows":1312,"n_cols":27,"rows_kept":1312,"cut":false,"hidden":true,"merged":[[7,1,7,8],[7,10,7,17],[7,9,8,9]]}
[]
[]
[null,"Ticker",{"$error":"#VALUE!"},"RiskFree",{"$f":"MAX(0.5%,risk_free-inflation)","v":3.0092747017813865E-2},null,0.17,null,null,null,{"$f":"FALSE","v":false},{"$f":"FALSE","v":false}]
[null,"Price",737.74,"Dividends",0,null,null,null,null,{"$f":"inflation","v":0}]
[null,"Maturity","2023-05-19T17:30:00","Style","European"]
[null,"TimetoT",{"$f":"(C5-NOW())/days_yr","v":-1.549532806677328},"stepsbinomial",25]
[null,null,null,null,null,null,null,null,null,null,null,null,null,null,null,null,null,null,null,null,null,null,null,null,-1.4999999999999999E-2,"Return:",{"$f":"IFERROR((AA9/100)/Y10,1.5%)","v":3.0092747017813865E-2}]
[null,"Call",null,null,null,null,null,null,null,"Strike","Put",null,null,null,null,null,null,null,null,null,"LongCall","ShortPut","ShortStock","PayOff","Cashinterest","AdjustedPayOff","100Contracts"]
[null,"Rho(+1%rf)","Theta","Vega(iv+1%)","Gamma","Delta","IVCall","Ask","Bid",null,"Bid","Ask","IVPut","Delta","Gamma","Vega","Theta","Rho",null,"Strike",{"$f":"MROUND(C4,5)","v":740},{"$f":"U9","v":740},null,null,"onCapital","min",{"$f":"MIN(AA12:AA100001)","v":2238.5182002382253}]
[null,1.0290701121617758,-3.8880434795487417E-2,0,0,1,4.8828125E-4,69.45,68.45,670,5.9,6.5,0.25927734375,-0.15172870938428451,3.1277497550773027E-3,0.68066344451126914,-0.14989623473680069,-0.18003391652248979,null,"Price",{"$f":"INDEX(H10:H1048576,MATCH(U$9,J10:J1048576,0))","v":18.25},{"$f":"INDEX(K10:K1048576,MATCH(V$9,J10:J1048576,0))","v":24.4},{"$f":"$C$4","v":737.74},null,{"$f":"W10+V10-U10-2*U11/100","v":743.87299999999993},"max",{"$f":"MAX(AA12:AA1048576)","v":2238.5182002382344}]
[null,1.0367497398646037,-3.9170587293938297E-2,0,0,1,4.8828125E-4,65.25,64.150000000000006,675,6.5,7.15,0.25537109375,-0.16624667835500317,3.3715832387444925E-3,0.72267242277858368,-0.1564813630769919,-0.1973763467415921,null,"TransactionCosts",0.85,0.85,0]
[null,1.0054376841148951,-6.16399499444924E-2,0.22314646244256994,2.2043834701487458E-3,0.96513612777484237,0.12060546875,60.95,59.95,680,7.25,7.9,0.25146484375,-0.181971452871457,3.6264613182015746E-3,0.76541361971065836,-0.16288576618603656,-0.21618203582195861,null,0,{"$f":"MAX(0,T12-$U$9)-$U$10-$U$11/100","v":-18.258500000000002},{"$f":"$V$10-MAX(0,$V$9-T12)-$V$11/100","v":-715.60850000000005},{"$f":"$W$10-T12","v":737.74},{"$f":"SUM(U12:W12)","v":3.8729999999999336},{"$f":"$Y$10*EXP($Y$7*$C$6)-$Y$10","v":17.49233385842183},{"$f":"EXP(-$E$3*$C$6)*SUM(X12:Y12)","v":22.385185851028979},{"$f":"Z12*100","v":2238.5185851028978}]
[null,0.96937637018993428,-8.5617634600680503E-2,0.4013640086796027,3.4605576034511913E-3,0.92708502019007788,0.13818359375,56.85,55.8,685,8.15,8.6999999999999993,0.24853515625,-0.19979302527293119,3.8857314286041061E-3,0.81058109333042627,-0.17013825755930156,-0.23759770074173048,null,1,{"$f":"MAX(0,T13-$U$9)-$U$10-$U$11/100","v":-18.258500000000002},{"$f":"$V$10-MAX(0,$V$9-T13)-$V$11/100","v":-714.60850000000005},{"$f":"$W$10-T13","v":736.74},{"$f":"SUM(U13:W13)","v":3.8729999999999336},17.49233385842183,{"$f":"EXP(-$E$3*$C$6)*SUM(X13:Y13)","v":22.385185851028979},{"$f":"Z13*100","v":2238.5185851028978}]
[null,0.93791908276875802,-0.10475142600500931,0.53261167584303803,4.3175589888052738E-3,0.89339457048024284,0.14697265625,52.7,51.75,690,9.1,9.6,0.24560546875,-0.21891964729792179,4.1494905927598252E-3,0.85539887887435873,-0.17701889052142405,-0.26062423443116245,null,2,-18.258500000000002,-713.60850000000005,735.74,{"$f":"SUM(U14:W14)","v":3.8729999999999336},17.49233385842183,22.385185851028979,2238.5185851028978]
[null,0.90619565662927926,-0.12176634682327858,0.64574144586648263,5.0339444286929278E-3,0.8597097572285789,0.15283203125,48.75,47.75,695,10.199999999999999,10.7,0.24365234375,-0.2401450098706166,4.4054245120217711E-3,0.90093657224040302,-0.18450620490636993,-0.28631714908149775,null,3,-18.258500000000002,-712.60850000000005,734.74,3.8729999999999336,17.49233385842183,22.385185851028979,2238.5185851028978]
[null,0.87555751466697984,-0.13558285490364597,0.74116698457558394,5.6691699309035573E-3,0.82707456861184192,0.15576171875,44.85,43.85,700,11.15,11.8,0.23876953125,-0.26047484190575454,4.6934889560071441E-3,0.94061211198446604,-0.18815953628131865,-0.31070920538226687,null,4,-18.258500000000002,-711.60850000000005,733.74,3.8729999999999336,17.49233385842183,22.385185851028979,2238.5185851028978]
[null,0.84304318609326856,-0.14788944502390677,0.82792702828851561,6.2543708799848432E-3,0.7929895056955929,0.15771484375,41.05,40,705,12.5,12.9,0.23583984375,-0.28371239128587167,4.9581030122601956E-3,0.98145091384428274,-0.19327687924501902,-0.33885348523139669,null,5,-18.258500000000002,-710.60850000000005,732.74,3.8729999999999336,17.49233385842183,22.385185851028979,2238.5185851028978]
[null,0.8073744361468016,-0.15941211038864367,0.9078647209618943,6.7743476466218845E-3,0.75644048496199257,0.15966796875,37.4,36.5,710,13.8,14.2,0.23291015625,-0.3083203885409862,5.2159432983467577E-3,1.0196641443474845,-0.19756598805710723,-0.36873180675570438,null,6,-18.258500000000002,-709.60850000000005,731.74,3.8729999999999336,17.49233385842183,22.385185851028979,2238.5185851028978]
[null,0.77183879411734324,-0.16769531471572918,0.97516323710299391,7.2765188775499538E-3,0.72004632616817954,0.15966796875,33.85,32.799999999999997,715,15.2,15.6,0.22900390625,-0.33375208229330833,5.4831216232292682E-3,1.0539175324366956,-0.19988311334046216,-0.39956439437304425,null,7,-18.258500000000002,-708.60850000000005,730.74,3.8729999999999336,17.49233385842183,22.385185851028979,2238.5185851028978]
[null,0.73349499194705459,-0.17466704034097802,1.0340317662687184,7.7157868354362216E-3,0.68147945991518299,0.15966796875,30.45,29.5,720,16.600000000000001,17.350000000000001,0.22607421875,-0.36111081070630358,5.7180681910296459E-3,1.0850162151105802,-0.20217023391722933,-0.43295558770762455,null,8,-18.258500000000002,-707.60850000000005,729.74,3.8729999999999336,17.49233385842183,22.385185851028979,2238.5185851028978]
[null,0.6937321629568487,-0.17907704324358065,1.0819717071328385,8.1231904615535842E-3,0.64181315906441816,0.15869140625,27.15,26.3,725,18.45,18.95,0.22314453125,-0.38972852962093185,5.9337371437994182E-3,1.1113488671934864,-0.20327556696474858,-0.46799490827118007,null,9,-18.258500000000002,-706.60850000000005,728.74,3.8729999999999336,17.49233385842183,22.385185851028979,2238.5185851028978]
[null,0.65154565490911409,-0.18177153090994125,1.1190406181573045,8.4535168155958698E-3,0.60033158393972663,0.15771484375,24.05,23.1,730,20.100000000000001,20.85,0.22021484375,-0.41952083141329677,6.1254301378595175E-3,1.1321892843732142,-0.20309567347783286,-0.50459972681977661,null,10,-18.258500000000002,-705.60850000000005,727.74,3.8729999999999336,17.49233385842183,22.385185851028979,2238.5185851028978]
[null,0.60738692739914768,-0.18259032991267077,1.1437826472019952,8.6942588017662869E-3,0.55744971049187875,0.15673828125,21,20.399999999999999,735,22.15,23,0.21728515625,-0.45037906989348109,6.2883284652719479E-3,1.1468355236373753,-0.20154071674903662,-0.5426594230829096,null,11,-18.258500000000002,-704.60850000000005,726.74,3.8729999999999336,17.49233385842183,22.385185851028979,2238.5185851028978]
[null,0.56190822703950971,-0.18043197842274594,1.1551187960715301,8.8912225562567705E-3,0.5135701347604249,0.15478515625,18.25,17.649999999999999,740,24.4,25.15,0.21533203125,-0.48209758149351922,6.3884562814439045E-3,1.154623583634435,-0.19953887706162732,-0.58214499066565395,null,12,-18.258500000000002,-703.60850000000005,725.74,3.8729999999999336,17.49233385842183,22.385185851028979,2238.5185851028978]
[null,0.51490783487292902,-0.17622280734019569,1.1522304016516045,8.9823316252864559E-3,0.46870874808974161,0.15283203125,15.7,15.1,745,26.8,27.75,0.21337890625,-0.51429239438297469,6.4492888339234737E-3,1.1550457107612837,-0.19606595275877226,-0.6224393320596846,null,13,-18.258500000000002,-702.60850000000005,724.74,3.8729999999999336,17.49233385842183,22.385185851028979,2238.5185851028978]
[null,0.46698171064088001,-0.16996653284849117,1.1344174807095442,8.9579477172964904E-3,0.42340212379050679,0.15087890625,13.25,12.85,750,29.45,30.45,0.21240234375,-0.54640178542630125,6.4391987782270099E-3,1.1479606361431365,-0.1921514008736267,-0.66310066854271099,null,14,-18.258500000000002,-701.60850000000005,723.74,3.8729999999999336,17.49233385842183,22.385185851028979,2238.5185851028978]
[null,0.41793689774385712,-0.16064445112471049,1.1006914526674101,8.863741015897866E-3,0.3773117610297822,0.14794921875,11.1,10.7,755,32.35,33.299999999999997,0.21240234375,-0.57778715449662688,6.3594686123626572E-3,1.1337465863711489,-0.18789686818917062,-0.70339777068261355,null,15,-18.258500000000002,-700.60850000000005,722.74,3.8729999999999336,17.49233385842183,22.385185851028979,2238.5185851028978]
[null,0.36986911529220379,-0.15057910180937029,1.0525305096126056,8.589296563067372E-3,0.33264154112307565,0.14599609375,9.1999999999999993,8.85,760,35.4,36.4,0.21142578125,-0.60912006215100012,6.2678635246231915E-3,1.1122779693144509,-0.18128920598991272,-0.74370931446316035,null,16,-18.258500000000002,-699.60850000000005,721.74,3.8729999999999336,17.49233385842183,22.385185851028979,2238.5185851028978]
[null,0.32441233251745416,-0.14017898485673186,0.99296625885672096,8.15778273660628E-3,0.29079193840181722,0.14501953125,7.75,7.1,765,38.75,39.700000000000003,0.21240234375,-0.63832511660449187,6.0893794933737731E-3,1.0855959254693295,-0.17569473138939884,-0.78221970761399007,null,17,-18.258500000000002,-698.60850000000005,720.74,3.8729999999999336,17.49233385842183,22.385185851028979,2238.5185851028978]
[null,0.27964277329570564,-0.12740142138298438,0.92012206990280987,7.6625252753136077E-3,0.24973515015434961,0.14306640625,6.15,5.8,770,42.3,43.3,0.21337890625,-0.66630346514709804,5.8842456072826909E-3,1.0538483892995456,-0.16912917338186162,-0.81956215340568406,null,18,-18.258500000000002,-697.60850000000005,719.74,3.8729999999999336,17.49233385842183,22.385185851028979,2238.5185851028978]
{"$rows_left_out":1283}
{"sheet":"Data","index":2,"n_rows":11,"n_cols":21,"rows_kept":11,"cut":false,"hidden":false,"merged":[]}
[]
[null,null,"Paste Below"]
[null,null,null,null,null,null,null,null,null,null,null,null,null,null,null,null,null,null,"Instructions: Copy DeGiro quotes from \"CALL\" to the last 'sell button'. Paste in cell C3."]
[null,null,null,null,null,null,null,null,null,null,null,null,null,null,null,null,null,null,true]
[]
[]
[null,null,null,null,null,null,null,null,null,null,null,null,null,null,null,null,null,null,null,null,{"$f":"author()","v":"Wessel van den Brink"}]
[null,null,null,null,null,null,null,null,null,null,null,null,null,null,null,null,null,null,null,null,8]
[null,null,null,null,null,null,null,null,null,null,null,null,null,null,null,null,null,null,null,null,{"$f":"_xlfn.IFS(print=\",\",\",\",AND(print<>\",\",ISERR(VALUE(print))=TRUE),\"\",ISERR(VALUE(print))=FALSE,print)","v":0}]
[null,null,null,null,null,null,null,null,null,null,null,null,null,null,null,null,null,null,null,null,0]
[null,null,null,null,null,null,null,null,null,null,null,null,null,null,null,null,null,null,null,null,{"$f":"TimeSpreadBool","v":false}]

{"sheet":"Trader","index":3,"n_rows":9,"n_cols":36,"rows_kept":9,"cut":false,"hidden":false,"merged":[[2,28,2,29],[2,33,2,34],[2,19,2,20],[7,1,7,8],[7,9,8,9],[7,10,7,17],[2,30,2,31],[2,21,2,22],[2,23,2,24],[5,21,5,22]]}
[]
[]
[null,"Ticker",{"$error":"#VALUE!"},"RiskFree",3.2500000000000001E-2,null,0.06,"Historical volatility σ",null,"TimeSpread",{"$f":"FALSE","v":false},{"$f":"TRUE","v":true},"Layout",null,null,null,null,null,null,"Contract",null,"Plotting",null,"Execute",null,null,null,null,"Strategy",null,"Plotting",null,"Positions","Statistics",null,"Execute"]
[null,"Price",{"$f":"_FV(Ticker,\"Price\",TRUE)*10","v":893.1},"Dividends",0,null,null,"T_yr = 252",{"$f":"histvol(C3,MAX(7,MIN(1000,C6*days_yr)),FALSE)","v":0.12529609454047844},"T_1",null,null,null,null,null,null,null,null,null,"Type","Call","Range% S_0",0.25,null,null,null,null,null,"Strategy (F9!)","Strangle","Range% U/L",0.15,null,"Max. Loss"]
[null,"Maturity","2025-09-19T17:30:00","Style","European",null,null,"T_yr = 365,25",{"$f":"histvol(C3,MAX(7,MIN(1000,C6*days_yr)),TRUE)","v":0.15084550601916707},"T_2",null,null,null,null,null,null,null,null,null,"Style","European","Plot","Gamma",null,null,null,null,null,"Move","Long","step",1,null,"Break Even"]
[null,"TimetoT",{"$f":"IF(C5=\"\",\"\",(C5-NOW())/days_yr)","v":0.78859011331660145},"stepsbinomial",25,null,null,"Mean",{"$f":"AVERAGE(I4:I5)","v":0.13807080027982277},"index_new",null,null,null,null,null,null,null,null,null,"Strike",900,"Statistics",null,null,null,null,null,null,"Style","European","Greeks T/F",true,null,"Max. Profit"]
[null,null,null,null,null,null,null,null,null,null,null,null,null,null,null,null,null,null,null,"Move","Long","BreakEven",{"$f":"IFERROR(BreakEven(U4,U6,U8),\"\")","v":""},null,null,null,null,null,{"$f":"IF(AD4=\"Straddle\",\"ATM (blank)\",IF($AD$4=\"Strangle\",\"|Put Delta|\",IF(RIGHT($AD$4,10)=\"TimeSpread\",\"Long |Delta|\",\"High |Delta|\")))","v":"|Put Delta|"},0.4,"Plot Greek:","Gamma"]
[null,"Call",null,null,null,null,null,null,null,"Strike","Put",null,null,null,null,null,null,null,null,"Price (Press F9)",{"$f":"IFERROR(_xlfn.IFS(AND(U4=\"Put\",U7=\"Short\"),INDEX(K10:K1048576,MATCH($U$6,$J$10:$J$1048576,0)),AND(U4=\"Put\",U7=\"Long\"),INDEX(L10:L1048576,MATCH($U$6,$J$10:$J$1048576,0)),AND(U4=\"Call\",U7=\"Short\"),INDEX(I10:I1048576,MATCH($U$6,$J$10:$J$1048576,0)),AND(U4=\"Call\",U7=\"Long\"),INDEX(H10:H1048576,MATCH($U$6,$J$10:$J$1048576,0))),\"\")","v":""},{"$f":"IF(U7=\"Long\",\"IV Ask Price\",\"IV Bid Price\")","v":"IV Ask Price"},{"$f":"IF(U8=\"\",\"\",IFERROR(AmericanVolatility($C$4,$U$6,$C$6,$E$3,$E$4,$U$8,25,$U$4,$U$5),\"\"))","v":""},null,null,null,{"$f":"COUNTA(AA10:AA1048576)","v":0},null,{"$f":"IF(AD4=\"Straddle\",\"ATM (blank)\",IF($AD$4=\"Strangle\",\"Call Delta\",IF(RIGHT($AD$4,10)=\"TimeSpread\",\"Short |Delta|\",\"Low |Delta|\")))","v":"Call Delta"},0.4,{"$f":"IF(RIGHT(strategy,10)=\"TimeSpread\",IF(AD5=\"Short\",\"(T_2-t)/T_2\",\"(T_1-t)/T_1\"),\"(T-t)/T\")","v":"(T-t)/T"},1]
[null,"Rho","Theta","Vega","Gamma","Delta","IVCall","Ask","Bid",null,"Bid","Ask","IVPut","Delta","Gamma","Vega","Theta","Rho",null,"StockPrice","Delta","Gamma","Vega","Theta","Rho","PayOffatT","TimeDecay",null,"StockPrice","Delta","Gamma","Vega","Theta","Rho",{"$f":"IF(RIGHT($AD$4,10)=\"TimeSpread\",\"Theoretical PayOff\",\"PayOffatT\")","v":"PayOffatT"}]

{"sheet":"Advanced","index":4,"n_rows":109,"n_cols":26,"rows_kept":109,"cut":false,"hidden":true,"merged":[[7,1,7,8],[7,9,8,9],[7,10,7,17],[3,16,6,17]]}
[]
[]
[null,"Ticker",{"$error":"#VALUE!"},"RiskFree",5.0000000000000001E-4,null,0.94,null,null,null,null,null,null,null,null,null,null,null,null,null,"Leg1","Leg2","Leg3","Leg4","Leg5"]
[null,"Price",{"$f":"_FV(C3,\"Price\")*10","v":896.9},"Dividends",0,null,null,null,null,null,null,null,null,null,null,null,"OptionVBA",null,null,"Type",null,null,null,null,null,{"$f":"COUNTA(U4:Y4)","v":0}]
[null,"Maturity","2022-02-18T17:30:00","Style","European",null,null,null,null,null,null,null,null,null,null,null,null,null,null,"Strike (or: Stock Price)",null,null,null,null,null,{"$f":"COUNTA(T10:T1048576)","v":0}]
[null,"TimetoT",{"$f":"IF(C5=\"\",\"\",(C5-NOW())/days_yr)","v":-2.7952549148224342},"stepsbinomial",25,null,null,null,null,null,null,null,null,null,null,null,null,null,null,"Move (finds price)"]
[null,null,null,null,null,null,null,null,null,null,null,null,null,null,null,null,null,null,null,"Price (F9) if Stock then Empty",{"$f":"IFERROR(_xlfn.IFS(AND(U4=\"Put\",U6=\"Short\"),INDEX($K$10:$K$1048576,MATCH(U$5,J$10:J$1048576,0)),AND(U4=\"Put\",U6=\"Long\"),INDEX($L$10:$L$1048576,MATCH($U$5,$J$10:$J$1048576,0)),AND(U4=\"Call\",U6=\"Short\"),INDEX($I$10:$I$1048576,MATCH($U$5,$J$10:$J$1048576,0)),AND(U4=\"Call\",U6=\"Long\"),INDEX($H$10:$H$1048576,MATCH($U$5,$J$10:$J$1048576,0))),\"\")","v":""},{"$f":"IFERROR(_xlfn.IFS(AND(V4=\"Put\",V6=\"Short\"),INDEX($K$10:$K$1048576,MATCH(V$5,J$10:J$1048576,0)),AND(V4=\"Put\",V6=\"Long\"),INDEX($L$10:$L$1048576,MATCH($V$5,$J$10:$J$1048576,0)),AND(V4=\"Call\",V6=\"Short\"),INDEX($I$10:$I$1048576,MATCH($V$5,$J$10:$J$1048576,0)),AND(V4=\"Call\",V6=\"Long\"),INDEX($H$10:$H$1048576,MATCH($V$5,$J$10:$J$1048576,0))),\"\")","v":""},{"$f":"IFERROR(_xlfn.IFS(AND(W4=\"Put\",W6=\"Short\"),INDEX($K$10:$K$1048576,MATCH(W$5,J$10:J$1048576,0)),AND(W4=\"Put\",W6=\"Long\"),INDEX($L$10:$L$1048576,MATCH($W$5,$J$10:$J$1048576,0)),AND(W4=\"Call\",W6=\"Short\"),INDEX($I$10:$I$1048576,MATCH($W$5,$J$10:$J$1048576,0)),AND(W4=\"Call\",W6=\"Long\"),INDEX($H$10:$H$1048576,MATCH($W$5,$J$10:$J$1048576,0))),\"\")","v":""},{"$f":"IFERROR(_xlfn.IFS(AND(X4=\"Put\",X6=\"Short\"),INDEX($K$10:$K$1048576,MATCH(X$5,J$10:J$1048576,0)),AND(X4=\"Put\",X6=\"Long\"),INDEX($L$10:$L$1048576,MATCH($X$5,$J$10:$J$1048576,0)),AND(X4=\"Call\",X6=\"Short\"),INDEX($I$10:$I$1048576,MATCH($X$5,$J$10:$J$1048576,0)),AND(X4=\"Call\",X6=\"Long\"),INDEX($H$10:$H$1048576,MATCH($X$5,$J$10:$J$1048576,0))),\"\")","v":""},{"$f":"IFERROR(_xlfn.IFS(AND(Y4=\"Put\",Y6=\"Short\"),INDEX($K$10:$K$1048576,MATCH(Y$5,J$10:J$1048576,0)),AND(Y4=\"Put\",Y6=\"Long\"),INDEX($L$10:$L$1048576,MATCH($Y$5,$J$10:$J$1048576,0)),AND(Y4=\"Call\",Y6=\"Short\"),INDEX($I$10:$I$1048576,MATCH($Y$5,$J$10:$J$1048576,0)),AND(Y4=\"Call\",Y6=\"Long\"),INDEX($H$10:$H$1048576,MATCH($Y$5,$J$10:$J$1048576,0))),\"\")","v":""}]
[null,"Call",null,null,null,null,null,null,null,"Strike","Put",null,null,null,null,null,null,null,null,"Amount* (minus if short)"]
[null,"Rho(+1%rf)","Theta","Vega(iv+1%)","Gamma","Delta","IVCall","Ask","Bid",null,"Bid","Ask","IVPut","Delta","Gamma","Vega","Theta","Rho",null,"StockPrice","PayOff Leg1","PayOff Leg2","PayOff Leg3","PayOff Leg4","PayOff Leg5","Aggregate"]
[null,null,null,null,null,null,null,null,null,null,null,null,null,null,null,null,null,null,null,null,null,null,null,null,null,{"$f":"IF(T10<>\"\",SUM(U10:Y10),\"\")","v":""}]
[null,null,null,null,null,null,null,null,null,null,null,null,null,null,null,null,null,null,null,null,null,null,null,null,null,{"$f":"IF(T11<>\"\",SUM(U11:Y11),\"\")","v":""}]
[null,null,null,null,null,null,null,null,null,null,null,null,null,null,null,null,null,null,null,null,null,null,null,null,null,""]
[null,null,null,null,null,null,null,null,null,null,null,null,null,null,null,null,null,null,null,null,null,null,null,null,null,""]
[null,null,null,null,null,null,null,null,null,null,null,null,null,null,null,null,null,null,null,null,null,null,null,null,null,""]
[null,null,null,null,null,null,null,null,null,null,null,null,null,null,null,null,null,null,null,null,null,null,null,null,null,""]
[null,null,null,null,null,null,null,null,null,null,null,null,null,null,null,null,null,null,null,null,null,null,null,null,null,""]
[null,null,null,null,null,null,null,null,null,null,null,null,null,null,null,null,null,null,null,null,null,null,null,null,null,""]
[null,null,null,null,null,null,null,null,null,null,null,null,null,null,null,null,null,null,null,null,null,null,null,null,null,""]
[null,null,null,null,null,null,null,null,null,null,null,null,null,null,null,null,null,null,null,null,null,null,null,null,null,""]
[null,null,null,null,null,null,null,null,null,null,null,null,null,null,null,null,null,null,null,null,null,null,null,null,null,""]
[null,null,null,null,null,null,null,null,null,null,null,null,null,null,null,null,null,null,null,null,null,null,null,null,null,""]
[null,null,null,null,null,null,null,null,null,null,null,null,null,null,null,null,null,null,null,null,null,null,null,null,null,""]
[null,null,null,null,null,null,null,null,null,null,null,null,null,null,null,null,null,null,null,null,null,null,null,null,null,""]
[null,null,null,null,null,null,null,null,null,null,null,null,null,null,null,null,null,null,null,null,null,null,null,null,null,""]
[null,null,null,null,null,null,null,null,null,null,null,null,null,null,null,null,null,null,null,null,null,null,null,null,null,""]
[null,null,null,null,null,null,null,null,null,null,null,null,null,null,null,null,null,null,null,null,null,null,null,null,null,""]
[null,null,null,null,null,null,null,null,null,null,null,null,null,null,null,null,null,null,null,null,null,null,null,null,null,""]
[null,null,null,null,null,null,null,null,null,null,null,null,null,null,null,null,null,null,null,null,null,null,null,null,null,""]
[null,null,null,null,null,null,null,null,null,null,null,null,null,null,null,null,null,null,null,null,null,null,null,null,null,""]
[null,null,null,null,null,null,null,null,null,null,null,null,null,null,null,null,null,null,null,null,null,null,null,null,null,""]
{"$rows_left_out":79}